Hochschule Offenburg Tensile Test Ontology (HSOTTO)
type: Ontology
creator: Janik Harter
license: http://creativecommons.org/licenses/by/4.0/
created: 2024-08-06
comment: The HSOTTO is based on the Tensile Test Ontology (TTO) and the PMD Core Ontology (PMDco) both created by Platform MaterialDigital. The HSOTTO provides conceptualizations valid for the description of tensile tests and corresponding data in accordance with the respective standard. By using HSOTTO for storing tensile test data, all data will be well structured and based on a common vocabulary agreed on by an expert group (generation of FAIR data) which will lead to enhanced data interoperability. This comprises several data categories such as primary data, secondary data and metadata. Data will be human and machine readable. The usage of HSOTTO facilitates data retrieval and downstream usage. Due to a close connection to the PMD core ontology (PMDco), the interoperability of tensile test data is enhanced and querying in combination with other aspects and data within the broad field of material science and engineering (MSE) is facilitated. The HSOTTO class structure forms a comprehensible and semantic layer for unified storage of data generated in a tensile test including the possibility to record data from analysis, re-evaluation and re-use. Furthermore, extensive metadata allows to assess data quality and reproduce experiments. Following the open world assumption, object properties are deliberately low restrictive and sparse.
imports: co
version IRI: https://w3id.org/hsotto/0.1
version info: 2.0.1

TestingMachineTensile 1
type: NamedIndividual
type: Metadata
type: Tensile Testing Machine
characteristic: TestingMachineTensile 1 manufacturer
characteristic: TestingMachineTensile 1 name
characteristic: TestingMachineTensile 1 serial number
characteristic: TestingMachineTensile 1 standard
characteristic: TestingMachineTensile 1 type
value: Zwick Roell Z250

Polygon
type: Class
label: Vieleck @de
subclass of: Shape
definition: Ein Vieleck ist eine ebene Figur, die mindestens drei Ecken hat und deren Seiten gerade miteinander verbunden sind. Zudem gibt es gleich viele Ecken wie Seiten in der Figur. @de
definition: A polygon is a flat figure that has at least three corners and whose sides are connected in a straight line. There are also the same number of corners as sides in the figure.

Crosshead separation
type: Class
label: Traversenweg (Querhaupttrennung) @de
subclass of: ValueObject
definition: Diese Eigenschaft beschreibt die Verschiebung der Traverse einer Zugprüfmaschine. @de
definition: Dimension analysis: L Unit (e.g. SI): mm
definition: This property describes the displacement of the crossheads of a tensile testing machine.

Change Of Transverse Dimension
type: Class
label: Änderung der transversalen Dimension @de
subclass of: Length
definition: Dieses Wertobjekt beschreibt eine Variation der Abmessungen eines Prüfkörpers in Bezug auf seine Querachse, die sich auf seine Querschnittsfläche auswirkt und möglicherweise während eines Zugversuchs auftritt. Das Verhältnis der wahren plastischen Breitendehnung und der wahren plastischen Dickendehnung in einem in uniaxialem Zug beanspruchten Prüfkörper (vertikale Anisotropie) kann anhand dieser Information berechnet werden. @de
definition: This value object describes a variation in the dimension of a test piece referring to its transversal axis affecting its cross-sectional area that may potentially occur during a tensile test. The ratio of the true plastic strain in width and the true plastic strain in thickness in a test piece loaded in uniaxial tension (vertical anisotropy) may be calculated using this information.
definition source: DIN EN ISO 10113:2021-06

Crosshead Separation Rate
type: Class
label: Traversengeschwindigkeit @de
subclass of: TestingRate
definition: Traversenweg je Zeiteinheit @de
definition: Symbol: v_c
definition: displacement of the crossheads per time
definition source: DIN EN ISO 6892-1:2019

Estimated Strain Rate Over The Parallel Length
type: Class
label: Abgeschätzte Dehngeschwindigkeit Über Die Parallele Länge @de
subclass of: TestingRate
definition: Zunahme der Dehnung über die parallele Länge der Probe je Zeiteinheit, basierend auf der Traversengeschwindigkeit und der parallelen Länge der Probe @de
definition: Symbol: e^._L_c
definition: value of the increase of strain over the parallel length of the test piece per time based on the crosshead separation rate and the parallel length of the test piece
definition source: DIN EN ISO 6892-1:2019

Final Gauge Length After Fracture
type: Class
label: Messlänge nach dem Bruch @de
label: Symbol: L_u
subclass of: Gauge Length
definition: Länge zwischen den Marken zur Kennzeichnung der Messlänge auf der Probe, die nach dem Bruch bei Raumtemperatur gemessen wird, nachdem die beiden Probenbruchstücke sorgfältig so zusammengefügt wurden, dass ihre Achsen in einer Geraden liegen @de
definition: length between gauge length marks on the test piece measured after rupture, at room temperature, the two pieces having been carefully fitted back together so that their axes lie in a straight line
definition source: DIN EN ISO 6892-1:2019

Percentage Elongation
type: Class
label: Dehnung @de
subclass of: Elongation
equivalent class: Restriction
  on property: relatesTo
  some values from: Original Gauge Length
definition: Verlängerung, angegeben in Prozent, bezogen auf die Anfangsmesslänge @de
definition: elongation expressed as a percentage of the original gauge length
definition source: DIN EN ISO 6892-1:2019

Percentage Permanent Elongation
type: Class
label: Bleibende Dehnung @de
subclass of: Elongation
equivalent class: Restriction
  on property: relatesTo
  some values from: Original Gauge Length
definition: Zunahme der Anfangsmesslänge einer Probe nach Entfernen einer festgelegten Zugspannung, angegeben in Prozent, bezogen auf die Anfangsmesslänge @de
definition: increase in the original gauge length of a test piece after removal of a specified stress, expressed as a percentage of the original gauge length
definition source: DIN EN ISO 6892-1:2019

Percentage Permanent Extension
type: Class
label: Bleibende Extensometer-Dehnung @de
subclass of: Extension
equivalent class: Restriction
  on property: relatesTo
  some values from: Extensometer Gauge Length
definition: Vergrößerung der Extensometer-Messlänge nach Entfernen einer festgelegten, auf die Probe aufgebrachten Zugspannung, angegeben in Prozent, bezogen auf die Extensometer-Messlänge @de
definition: increase in the extensometer gauge length, after removal of a specified stress from the test piece, expressed as a percentage of the extensometer gauge length
definition source: DIN EN ISO 6892-1:2019

Percentage Plastic Extension At Maximum Force
type: Class
label: Plastische Extensometer-Dehnung bei Höchstkraft @de
subclass of: Extension
equivalent class: Class
  intersection of: Restriction
    on property: relatesTo
    some values from: Extensometer Gauge Length
  intersection of: Restriction
    on property: relatesTo
    some values from: Maximum Force
definition: plastische Verlängerung der Extensometer-Messlänge bei Höchstkraft, angegeben in Prozent, bezogen auf die Extensometer-Messlänge @de
definition: Symbol: A_g
definition: plastic extension at maximum force, expressed as a percentage of the extensometer gauge length
definition source: DIN EN ISO 6892-1:2019

Percentage Reduction Of Area
type: Class
label: Brucheinschnürung @de
subclass of: ValueObject
equivalent class: Class
  intersection of: Restriction
    on property: relatesTo
    some values from: Minimum cross-sectional area after fracture
  intersection of: Restriction
    on property: relatesTo
    some values from: Original cross-sectional area of the parallel length
definition: größte während des Versuchs aufgetretene Änderung des Querschnitts (S_o − S_u), angegeben in Prozent, bezogen auf den Anfangsquerschnitt S_o @de
definition: maximum change in cross-sectional area which has occurred during the test (S_o − S_u), expressed as a percentage of the original cross-sectional area, S_o
definition source: DIN EN ISO 6892-1:2019
symbol: Z

Percentage Total Extension At Fracture
type: Class
label: Gesamte Extensometer-Dehnung beim Bruch @de
subclass of: Extension
equivalent class: Restriction
  on property: relatesTo
  some values from: Extensometer Gauge Length
definition: gesamte Verlängerung (elastische plus plastische Verlängerung) der Extensometer-Messlänge beim Bruch, angegeben in Prozent, bezogen auf die Extensometer-Messlänge @de
definition: Symbol: A_t
definition: total extension (elastic extension plus plastic extension) at the moment of fracture, expressed as a percentage of the extensometer gauge length
definition source: DIN EN ISO 6892-1:2019

Percentage Total Extension At Maximum Force
type: Class
label: Gesamte Extensometer-Dehnung bei Höchstkraft @de
subclass of: Extension
equivalent class: Class
  intersection of: Restriction
    on property: relatesTo
    some values from: Extensometer Gauge Length
  intersection of: Restriction
    on property: relatesTo
    some values from: Maximum Force
definition: gesamte Verlängerung (elastische plus plastische Verlängerung) der Extensometer-Messlänge bei Höchstkraft, angegeben in Prozent, bezogen auf die Extensometer-Messlänge @de
definition: Symbol: A_gt
definition: total extension (elastic extension plus plastic extension) at maximum force, expressed as a percentage of the extensometer gauge length
definition source: DIN EN ISO 6892-1:2019

Percentage Yield Point Extension
type: Class
label: Streckgrenzen-Extensometer-Dehnung @de
subclass of: Extension
definition: Bei Werkstoffen, die ein diskontinuierliches Fließen zeigen: Verlängerung der Extensometer-Messlänge zwischen dem Beginn örtlichen Fließens und dem Einsetzen gleichmäßiger Verfestigung, angegeben in Prozent, bezogen auf die Extensometer-Messlänge @de
definition: For discontinuous yielding materials: extension between the start of yielding and the start of uniform work-hardening, expressed as a percentage of the extensometer gauge length
definition: Symbol: A_e
definition source: DIN EN ISO 6892-1:2019

Proof Strength Total Extension
type: Class
label: Dehngrenze bei gesamter Extensometer-Dehnung @de
subclass of: Proof Strength
equivalent class: Restriction
  on property: relatesTo
  some values from: Extensometer Gauge Length
definition: Spannung, bei der die gesamte Extensometer-Dehnung (elastische und plastische Extensometer-Dehnung) einem vorgegebenen Prozentanteil der Extensometer-Messlänge entspricht Anmerkung: Der Index wird durch den Zahlenwert ergänzt, der den vorgegebenen Zahlenwert der gesamten Extensometer-Dehnung in Prozent angibt, z. B. R_t_0,5. @de
definition: Symbol: R_t
definition: stress at which total extension (elastic extension plus plastic extension) is equal to a specified percentage of the extensometer gauge length Note: A suffix is added to the subscript to indicate the prescribed percentage, e.g. R_t_0.5.
definition source: DIN EN ISO 6892-1:2019

Proof Strength Plastic Extension Rp01
type: Class
label: Dehngrenze bei plastischer Extensometer-Dehnung Rp01 @de
subclass of: Proof Strength Plastic Extension
equivalent class: Restriction
  on property: relates to extension
  some values from: Restriction
    has value: 0.1
    on property: value
definition: Spannung bei einer plastischen Extensometer-Dehnung, die 0,1 Prozent der Extensometer-Messlänge entspricht @de
definition: Symbol: R_p_0.1
definition: stress at which the plastic extension is equal to 0.1 percent of the extensometer gauge length
definition source: DIN EN ISO 6892-1:2019

Proof Strength Plastic Extension Rp02
type: Class
label: Dehngrenze bei plastischer Extensometer-Dehnung Rp02 @de
subclass of: Proof Strength Plastic Extension
equivalent class: Restriction
  on property: relates to extension
  some values from: Restriction
    has value: 0.2
    on property: value
definition: Spannung bei einer plastischen Extensometer-Dehnung, die 0,2 Prozent der Extensometer-Messlänge entspricht @de
definition: Symbol: R_p_0.2
definition: stress at which the plastic extension is equal to 0.2 percent of the extensometer gauge length
definition source: DIN EN ISO 6892-1:2019

Stress Rate
type: Class
label: Spannungsgeschwindigkeit @de
subclass of: TestingRate
definition: Zunahme der Spannung je Zeiteinheit Anmerkung: Die Spannungsgeschwindigkeit wird nur im elastischen Bereich des Versuchs verwendet. @de
definition: Symbol: R
definition: increase of stress per time Note: Stress rate is only used in the elastic part of the test.
definition source: DIN EN ISO 6892-1:2019

Transition Point Testing Rate
type: Class
label: Umschaltpunkt der Prüfgeschwindigkeit @de
subclass of: Transition Point
equivalent class: Restriction
  on property: relatesTo
  some values from: TestingRate
definition: Diese Entität beschreibt den Umschaltpunkt der Prüfgeschwindigkeit während eines Analyse- / Testprozesses, z.B. den Punkt bezogen auf die Dehnung oder Spannung, an welchem die Prüfgeschwindigkeit während eines Zugversuchs geändert wird. Typischerweise ist dieser Punkt mit einer Abnahme des Extensometers (Dehnungsaufnehmers) vom Prüfkörper während eines dehnungsgeregelten Zugversuchs verbunden. @de
definition: This entity describes the the transition point of the testing rate during an analysis / test process, e.g. the point referring to the strain or the stress at which the testing rate is changed during a tensile test. Typically, this transition point is associated with a removal of the extensometer from the test piece during a strain-controlled tensile test.

Type Gauge Length Marks
type: Class
label: Typ Der Messlängenmarkierungen @de
subclass of: TestPieceInfo
definition: Diese Eigenschaft wird verwendet, um die sichtbaren Markierungen zu beschreiben, die in der Regel während eines Zugversuchs zur Messung der Dehnung an den Prüfkörpern angebracht werden. @de
definition: This property is used to describe the visible markers usually attached to test pieces during a tensile test for elongation / extension measurements.

Debug-001 Debug
type: NamedIndividual
type: Process Identifier
value: Debug-001_Debug

Debug-001 Debug crossSectionArea S0
type: NamedIndividual
type: Measurement
type: Primary Data
type: OriginalCrossSectionArea
unit: MilliM2
value: 144.0

Debug-001 Debug date
type: NamedIndividual
type: Date
type: Metadata
value: 2026-06-30

Debug-001 Debug materialDescription
type: NamedIndividual
type: Metadata
type: materialDesignation
value: Debug

Debug-001 Debug matriculation number
type: NamedIndividual
type: matriculation number
type: Metadata
value: 121033017

Debug-001 Debug operator
type: NamedIndividual
type: Metadata
type: Operator
value: Moser

Debug-001 Debug specimen shape
type: NamedIndividual
type: Metadata
type: Rectangular
type: Geometry Shape
value: Flach

Debug-001 Debug thickness
type: NamedIndividual
type: Measurement
type: Primary Data
type: Original Thickness
unit: MilliM
value: 6.0

Debug-001 Debug time
type: NamedIndividual
type: Metadata
type: Start Time
value: 10:15

Debug-001 Debug width
type: NamedIndividual
type: Measurement
type: Primary Data
type: Original Width
unit: MilliM
value: 24.0

process/Debug-001_Debug_testpiece_id/Debug-001
type: NamedIndividual
type: Table
type: Dataset
format: text/csv
table schema: Debug-001 schema
url: zugversuch_baustahl_zwick.csv

Debug-001 name
type: NamedIndividual
type: Metadata
type: Test Piece Name
value: Debug-001

Debug-001 schema
type: NamedIndividual
type: Schema
column: Dehnung;Standardkraft;Spannung;DehnungProzent

Debug-002 Debug
type: NamedIndividual
type: Process Identifier
value: Debug-002_Debug

Debug-002 Debug crossSectionArea S0
type: NamedIndividual
type: Measurement
type: Primary Data
type: OriginalCrossSectionArea
unit: MilliM2
value: 144.0

Debug-002 Debug date
type: NamedIndividual
type: Date
type: Metadata
value: 2026-06-30

Debug-002 Debug materialDescription
type: NamedIndividual
type: Metadata
type: materialDesignation
value: Debug

Debug-002 Debug matriculation number
type: NamedIndividual
type: matriculation number
type: Metadata
value: 1234

Debug-002 Debug operator
type: NamedIndividual
type: Metadata
type: Operator
value: Janik

Debug-002 Debug specimen shape
type: NamedIndividual
type: Metadata
type: Rectangular
type: Geometry Shape
value: Flach

Debug-002 Debug thickness
type: NamedIndividual
type: Measurement
type: Primary Data
type: Original Thickness
unit: MilliM
value: 6.0

Debug-002 Debug time
type: NamedIndividual
type: Metadata
type: Start Time
value: 10:16

Debug-002 Debug width
type: NamedIndividual
type: Measurement
type: Primary Data
type: Original Width
unit: MilliM
value: 24.0

process/Debug-002_Debug_testpiece_id/Debug-002
type: NamedIndividual
type: Table
type: Dataset
format: text/csv
table schema: Debug-002 schema
url: zugversuch_baustahl_zwick.csv

Debug-002 name
type: NamedIndividual
type: Metadata
type: Test Piece Name
value: Debug-002

Debug-002 schema
type: NamedIndividual
type: Schema
column: Dehnung;Standardkraft;Spannung;DehnungProzent

Debug-003 Debug
type: NamedIndividual
type: Process Identifier
value: Debug-003_Debug

Debug-003 Debug crossSectionArea S0
type: NamedIndividual
type: Measurement
type: Primary Data
type: OriginalCrossSectionArea
unit: MilliM2
value: 144.0

Debug-003 Debug date
type: NamedIndividual
type: Date
type: Metadata
value: 2026-06-30

Debug-003 Debug materialDescription
type: NamedIndividual
type: Metadata
type: materialDesignation
value: Debug

Debug-003 Debug matriculation number
type: NamedIndividual
type: matriculation number
type: Metadata
value: 123123

Debug-003 Debug operator
type: NamedIndividual
type: Metadata
type: Operator
value: Moser

Debug-003 Debug specimen shape
type: NamedIndividual
type: Metadata
type: Rectangular
type: Geometry Shape
value: Flach

Debug-003 Debug thickness
type: NamedIndividual
type: Measurement
type: Primary Data
type: Original Thickness
unit: MilliM
value: 6.0

Debug-003 Debug time
type: NamedIndividual
type: Metadata
type: Start Time
value: 12:42

Debug-003 Debug width
type: NamedIndividual
type: Measurement
type: Primary Data
type: Original Width
unit: MilliM
value: 24.0

process/Debug-003_Debug_testpiece_id/Debug-003
type: NamedIndividual
type: Table
type: Dataset
format: text/csv
table schema: Debug-003 schema
url: zugversuch_baustahl_zwick.csv

Debug-003 name
type: NamedIndividual
type: Metadata
type: Test Piece Name
value: Debug-003

Debug-003 schema
type: NamedIndividual
type: Schema
column: Dehnung;Standardkraft;Spannung;DehnungProzent

Debug manufacturer
type: NamedIndividual
type: Metadata
value: Debug

Debug model
type: NamedIndividual
type: Metadata
value: Debug-Zugmaschine

Debug serial number
type: NamedIndividual
type: Metadata
value: DEBUG

Debug standards
type: NamedIndividual
type: Metadata
value: DIN EN ISO 6892-1

TestingMachineTensile 1 manufacturer
type: NamedIndividual
type: Manufacturer
type: Metadata
value: Zwick Roell

TestingMachineTensile 1 name
type: NamedIndividual
type: Metadata
type: NodeName
value: TestingMachineTensile_X

TestingMachineTensile 1 serial number
type: NamedIndividual
type: Metadata
type: NodeSerialNumber
value: 257128

TestingMachineTensile 1 standard
type: NamedIndividual
type: Metadata
type: Norm
value: DIN EN ISO 7500-1:2018, DIN EN ISO 9513

TestingMachineTensile 1 type
type: NamedIndividual
type: NodeType
type: Metadata
value: Zwick Roell Z250

institute HSO address
type: NamedIndividual
type: Address
type: Metadata
value: Badstraße 24 77652 Offenburg

Area
type: Class
label: Fläche @de
subclass of: ValueObject
definition: The extent or measurement of a surface.

Digital Entity
type: Class
definition: An entity with digital representation.

Location
type: Class
label: Ort @de
subclass of: ValueObject
definition: Eine Position oder ein Ort, der besetzt ist oder besetzt werden kann oder durch ein bestimmtes Merkmal gekennzeichnet ist. @de
definition: A position or site occupied or available for occupancy or marked by some distinguishing feature.

Diameter After Fracture
type: Class
label: End-Probendurchmesser @de
subclass of: Diameter
definition: Die Länge einer geraden Linie durch den Mittelpunkt eines Objekts (Zugprüfstücks), gemessen nach einem Bruch, der während einer Prüfung aufgetreten ist. @de
definition: The length of a straight line through the center of an object (tensile test piece) as measured after a fracture occured during a test.

Minimum cross-sectional area after fracture
type: Class
label: Kleinster Querschnitt nach dem Bruch @de
comment: Symbol: S_u
subclass of: Cross Section Area
equivalent class: Class
  union of: Class
    intersection of: Restriction
      on property: relatesTo
      some values from: Thickness After Fracture
    intersection of: Restriction
      on property: relatesTo
      some values from: Width After Fracture
  union of: Restriction
    on property: relatesTo
    some values from: Diameter After Fracture
definition: Dieses Konzept beschreibt die kleinste Querschnittsfläche des Zugprüfkörers, die nach dem Bruch infolge der aufgebrachten Zugkraft erhalten wird. Anmerkung: Sie wird in der Regel senkrecht zur Richtung der aufgebrachten Kraft gemessen und dient zur Berechnung der technischen Spannung während der Prüfung. Anmerkung: Es wird empfohlen, den Anfangsquerschnitt innerhalb der parallelen Länge mit einer Genauigkeit von ±2 % zu messen. Bei runden Prüfkörpern mit kleinem Durchmesser oder Prüfkörpern mit anderen Querschnittsgeometrien ist es jedoch möglicherweise nicht möglich, den Anfangsquerschnitt innerhalb der parallelen Länge mit einer Genauigkeit von ±2 % zu messen. @de
definition: This concept describes the smallest cross-sectional area of the tensile test piece observed after it has fractured under the applied tensile force. Note: It is typically measured perpendicular to the direction of the applied force and is used to calculate engineering stress during the test. Note: It is recommended to measure the original cross-sectional area of the parallel length to an accuracy of ±2 %. However, measuring the original cross-sectional area of the parallel length with an accuracy of ±2 % on small diameter round test pieces, or test pieces with other cross-sectional geometries, may not be possible.
definition source: DIN EN ISO 6892-1:2019

Original cross-sectional area of the parallel length
type: Class
label: Anfangsquerschnitt innerhalb der parallelen Länge @de
comment: Symbol: S_o
subclass of: Cross Section Area
equivalent class: Class
  union of: Class
    intersection of: Restriction
      on property: relatesTo
      some values from: Original Thickness
    intersection of: Restriction
      on property: relatesTo
      some values from: Original Width
  union of: Restriction
    on property: relatesTo
    some values from: Original Diameter
definition: Dieses Konzept beschreibt die initiale Querschnittsfläche des Zugprüfkörpers entlang seiner parallelen Länge, bevor eine Verformung auftritt. @de
definition: This concept describes the initial area of the tensile test piece before any deformation occurs.
definition source: DIN EN ISO 6892-1:2019

Original Diameter
type: Class
label: Anfangs-Probendurchmesser @de
subclass of: Diameter
definition: Die Länge einer geraden Linie durch den Mittelpunkt eines Objekts (Zugprüfkörpers), die vor einer Prüfung gemessen wird. @de
definition: The length of a straight line through the center of an object (tensile test piece) as measured prior to a tensile test.
definition source: DIN EN ISO 6892-1:2019

Thickness After Fracture
type: Class
label: End-Dicke @de
subclass of: Thickness
definition: Diese Entität beschreibt die gemessene Dimension in einer Richtung eines Prüfstücks, wie sie vor der Prüfung gemessen wurde. @de
definition: This entity describes the measured dimension in one direction of a test piece, as measured after the test.

Transition Point
type: Class
label: Umschaltpunkt @de
subclass of: ValueObject
definition: Diese Entität beschreibt einen einzelnen Punkt, an dem ein Übergang von einer Bedingung oder einem Zustand in einen anderen erfolgt, z. B. der Punkt, an dem verschiedene Phasen von Materie im Gleichgewicht miteinander existieren können (auch Inversionspunkt genannt) oder wenn Prozessparameter geändert werden, die zu einem Übergang des Prozesses während seiner Ausführung führen. @de
definition: This entity describes a single point at which a transition from one condition or state to another occurs, e.g. the point at which different phases of matter are capable of existing together in equilibrium (also called inversion point) or if process parameters are changed that will lead to a transition of the process during its execution.

Width After Fracture
type: Class
label: End-Breite @de
subclass of: Width
definition: Diese Entität beschreibt eine horizontale Messung eines Objekts (Prüfkörpers) im rechten Winkel zur Länge des Objekts (Prüfkörpers), wie sie nach einer Prüfung gemessen wird. @de
definition: This entity describes a horizontal measurement of an object (test piece) taken at right angles to the length of the object (test piece), as measured after a test.

Debug-001 Debug lowerYieldStrength
type: NamedIndividual
type: Measurement
type: Secondary Data
type: Lower Yield Strength
unit: MegaPA
value: 322.57

Debug-001 Debug maximumForce
type: NamedIndividual
type: Measurement
type: Secondary Data
type: Maximum Force
unit: KiloN
value: 66.08098

Debug-001 Debug modulusOfElasticity
type: NamedIndividual
type: Measurement
type: ModulusOfElasticity
type: Secondary Data
type: Slope Of The Elastic Part
unit: GigaPA
value: 397.92722

Debug-001 Debug original gauge length L0
type: NamedIndividual
type: Measurement
type: Primary Data
type: Original Gauge Length
unit: MilliM
value: 147.5

Debug-001 Debug parallel length Lc
type: NamedIndividual
type: Measurement
type: Primary Data
type: Parallel Length
unit: MilliM
value: 160.0

Debug-001 Debug percentageElongationAfterFracture
type: NamedIndividual
type: Measurement
type: Secondary Data
type: Percentage Elongation After Fracture
unit: PERCENT
value: 15.47

Debug-001 Debug rSquared
type: NamedIndividual
type: Measurement
type: Secondary Data
type: ValueObject
value: 0.99937326

Debug-001 Debug tensileStrength Rm
type: NamedIndividual
type: Measurement
type: Secondary Data
type: Tensile Strength
unit: MegaPA
value: 458.9

Debug-001 Debug upperYieldStrength
type: NamedIndividual
type: Measurement
type: Secondary Data
type: Upper Yield Strength
unit: MegaPA
value: 395.42

Debug-002 Debug lowerYieldStrength
type: NamedIndividual
type: Measurement
type: Secondary Data
type: Lower Yield Strength
unit: MegaPA
value: 322.57

Debug-002 Debug maximumForce
type: NamedIndividual
type: Measurement
type: Secondary Data
type: Maximum Force
unit: KiloN
value: 66.08098

Debug-002 Debug modulusOfElasticity
type: NamedIndividual
type: Measurement
type: ModulusOfElasticity
type: Secondary Data
type: Slope Of The Elastic Part
unit: GigaPA
value: 397.92722

Debug-002 Debug original gauge length L0
type: NamedIndividual
type: Measurement
type: Primary Data
type: Original Gauge Length
unit: MilliM
value: 147.5

Debug-002 Debug parallel length Lc
type: NamedIndividual
type: Measurement
type: Primary Data
type: Parallel Length
unit: MilliM
value: 160.0

Debug-002 Debug percentageElongationAfterFracture
type: NamedIndividual
type: Measurement
type: Secondary Data
type: Percentage Elongation After Fracture
unit: PERCENT
value: 15.47

Debug-002 Debug rSquared
type: NamedIndividual
type: Measurement
type: Secondary Data
type: ValueObject
value: 0.99937326

Debug-002 Debug tensileStrength Rm
type: NamedIndividual
type: Measurement
type: Secondary Data
type: Tensile Strength
unit: MegaPA
value: 458.9

Debug-002 Debug upperYieldStrength
type: NamedIndividual
type: Measurement
type: Secondary Data
type: Upper Yield Strength
unit: MegaPA
value: 395.42

Debug-003 Debug lowerYieldStrength
type: NamedIndividual
type: Measurement
type: Secondary Data
type: Lower Yield Strength
unit: MegaPA
value: 322.57

Debug-003 Debug maximumForce
type: NamedIndividual
type: Measurement
type: Secondary Data
type: Maximum Force
unit: KiloN
value: 66.08098

Debug-003 Debug modulusOfElasticity
type: NamedIndividual
type: Measurement
type: ModulusOfElasticity
type: Secondary Data
type: Slope Of The Elastic Part
unit: GigaPA
value: 397.92722

Debug-003 Debug original gauge length L0
type: NamedIndividual
type: Measurement
type: Primary Data
type: Original Gauge Length
unit: MilliM
value: 147.5

Debug-003 Debug parallel length Lc
type: NamedIndividual
type: Measurement
type: Primary Data
type: Parallel Length
unit: MilliM
value: 160.0

Debug-003 Debug percentageElongationAfterFracture
type: NamedIndividual
type: Measurement
type: Secondary Data
type: Percentage Elongation After Fracture
unit: PERCENT
value: 15.47

Debug-003 Debug rSquared
type: NamedIndividual
type: Measurement
type: Secondary Data
type: ValueObject
value: 0.99937326

Debug-003 Debug tensileStrength Rm
type: NamedIndividual
type: Measurement
type: Secondary Data
type: Tensile Strength
unit: MegaPA
value: 458.9

Debug-003 Debug upperYieldStrength
type: NamedIndividual
type: Measurement
type: Secondary Data
type: Upper Yield Strength
unit: MegaPA
value: 395.42

Cross Section Area
type: Class
label: Querschnittsfläche @de
subclass of: Area
definition: Diese Eigenschaft beschreibt die Fläche eines Schnittes oder eines rechtwinklig geschnittenen oder gebrochenen Stücks eines Objektes in Bezug auf eine Achse. @de
definition: This property describes the area of a cutting or piece of an object cut off or broken at right angles or related to an axis.

Shape
type: Class
label: Form @de
subclass of: ValueObject
definition: Das sichtbare Ausstattungsmerkmal (räumliche Form oder Kontur) eines bestimmten Objektes oder einer Art von Objekt. @de
definition: The visible makeup characteristic (spatial form or contour) of a particular item or kind of item.

Time
type: Class
label: Zeit @de
subclass of: ValueObject
definition: A nonspatial continuum that is measured in terms of events which succeed one another from past through present to future.

Value Scope
type: Class
label: Wertekategorie @de
definition: Eine Entität, die es ermöglicht "ValueObjects" zusätzlich zu kategorisieren. @de
definition: This class expresses the categorization of :ValueObjects into measurements and setpoints.

Proof Strength
type: Class
label: Dehngrenze @de
subclass of: ValueObject
definition: Spannung, bei der ein bestimmter Dehnungswert gleich einem bestimmten Prozentsatz der Messlänge des Dehnungsmessers ist @de
definition: stress at which the a specific extension value is equal to a specified percentage of the extensometer gauge length

Yield Strength
type: Class
label: Streckgrenze @de
subclass of: ValueObject
equivalent class: Restriction
  on property: relatesTo
  some values from: Stress
definition: Wenn der metallische Werkstoff diese Eigenschaft aufweist: die Spannung zu einem bestimmten Zeitpunkt während des Versuchs bei dem eine plastische Verformung ohne Zunahme der Kraft auftritt @de
definition: when the metallic material exhibits a yield phenomenon, stress corresponding to the point reached during the test at which plastic deformation occurs without any increase in the force
definition source: DIN EN ISO 6892-1:2019

Auftraggeber
type: NamedIndividual
type: Organization
type: Metadata
value: Bundesministerium für Bildung und Forschung

standard
type: NamedIndividual
type: Metadata
type: Norm
value: DIN EN ISO 6892-1

control type of the testing rate
type: Class
label: Regelungsart der Prüfgeschwindigkeit @de
subclass of: ValueObject
definition: Regelungsart der Prüfgeschwindigkeit angegeben in Buchstaben A1/A2 oder B. Norm DIN EN ISO 6892-1:2019 definiert die Prüfgeschwindigkeit basierend auf der Spannungsgeschwindigkeit und/oder der Dehngeschwindigkeit. @de
definition: Control type of testing rate specified as A1/A2 or B. DIN EN ISO 6892-1:2019 defines the testing rate based on the stress rate and/or the strain rate.

matriculation number
type: Class
label: Matrikelnummer @de
subclass of: Identifier
definition: Optionale Matrikelnummer der/des Studierenden, die/der den Versuch durchgeführt hat. Dient der Zuordnung des Versuchs im Lehrbetrieb. @de
definition: Optional matriculation (student enrolment) number of the student who carried out the test. Used to attribute the experiment in teaching.

Data Scope
type: Class
label: Datenkategorie @de
definition: Die Entität Datenkategorie dient der Kategorisierung von Daten im Hinblick auf ihren Verwendungszweck in Übereinstimmung mit einem betrachteten Objekt oder Prozess. @de
definition: This class is used to categorize data with respect to their intended usage in accordance with a regarded object or process.

Dataset
type: Class
label: Datensatz @de
subclass of: Digital Entity
definition: A collection of data published in one or more files. Usually instances of this class are also instances of DCAT dataset (see https://www.w3.org/TR/vocab-dcat-2/).

Date
type: Class
label: Datum @de
subclass of: Time
definition: Eine Erklärung über den Tag der Ausführung oder Herstellung. Basierend auf dem gregorianischen Kalendersystem. @de
definition: A statement of the day of execution or making. Based on an the gregorian calender system.

Operator
type: Class
definition: A person that operates a machine or device.

Process Identifier
type: Class
label: Prozessidentifikator @de
subclass of: Identifier
definition: Ein umgangssprachlicher, von Menschen erstellter, beschreibender Text, der die Art einer Prozessinstanz qualifiziert, die als Kennung verwendet wird, die nicht unbedingt eindeutig sein muss, z.B. “1050°C30 840°C10/ÖL”. @de
definition: A colloquial, human-generated, descriptive text qualifying the nature of a process instance used as an identifier that is not strictly intended to be unique, e.g. “1050°C30 840°C10/ÖL”.

Project
type: Class
label: Projekt @de
definition: Eine Reihe von zielorientierten (absichtlichen) Aktivitäten und Interaktionen, um ein bestimmtes Ergebnis zu erzielen. @de
definition: A series of goal-orientated (intent) activities and interactions to achieve a specific outcome.

Project Identifier
type: Class
label: Projektidentifikator @de
subclass of: Identifier
definition: Ein umgangssprachlicher, von Menschen erstellter, beschreibender Text, der die Art eines Projekts qualifiziert. @de
definition: A colloquial, human-generated, descriptive text qualifying the nature of a project.

Rectangular
type: Class
label: Rechteckig @de
subclass of: Shape
definition: Geformt wie ein Rechteck. @de
definition: Shaped like a rectangle.

Set Point
type: Class
label: Sollwert @de
subclass of: Value Scope
definition: Die Wertekategorie Sollwert bezeichnet allgemein den gewünschten Wert eines quantitativen Merkmals eines Systems, von dem der Istwert möglichst wenig abweichen soll. @de
definition: The ValueScope Setpoint generally refers to the desired value of a quantitative characteristic of a system, from which the actual value should deviate as little as possible.

Start Time
type: Class
label: Startzeit @de
subclass of: Time
definition: The date and time when a plan/recipe or process is executed.

Test Piece Name
type: Class
label: Prüfkörpername @de
subclass of: Identifier
definition: Diese Eigenschaft beschreibt die Bezeichnung eines Prüfkörpers, die in der Regel als menschenlesbarer Identifikator von Menschen vergeben wird. @de
definition: This property describes the designation of a test piece, usually given as human-readable identifier by humans.

Elongation
type: Class
label: Verlängerung @de
subclass of: ValueObject
equivalent class: Restriction
  on property: relatesTo
  some values from: Original Gauge Length
definition: Zunahme der Anfangsmesslänge zu einem beliebigen Zeitpunkt während des Versuchs @de
definition: increase in the original gauge length at any moment during the test
definition source: DIN EN ISO 6892-1:2019

Gauge Length
type: Class
label: Messlänge @de
subclass of: Length
definition: Länge des parallelen Teils der Probe, an dem zu einem beliebigen Zeitpunkt während des Versuchs die Verlängerung gemessen wird @de
definition: Symbol: L
definition: length of the parallel portion of the test piece on which elongation is measured at any moment during the test
definition source: DIN EN ISO 6892-1:2019

Geometry Shape
type: Class
label: Geometrische Form @de
subclass of: TestPieceInfo
definition: Diese Eigenschaft beschreibt die geometrischen Abmessungen und das Erscheinungsbild (Form und Abmaße) einer Probe, eines Prüfkörpers oder eines Prüfstücks, wie sie üblicherweise durch eine entsprechende Norm definiert sind. Dementsprechend ist der angegebene Formwert in Übereinstimmung mit der definierenden Norm anzugeben, z. B. "Zugprüfstück Form 1 gemäß Anhang B". @de
definition: This property describes the geometric dimensions and appearance (shape and dimensions) of a sample, specimen, or test piece as usually defined by a corresponding standard. Accordingly, the shape value given is in accordance with the defining standard, e.g., ‘tensile test piece shape 1 in accordance with annex B’.
definition source: DIN EN ISO 6892-1:2019

Lower Yield Strength
type: Class
label: untere Streckgrenze @de
subclass of: Yield Strength
equivalent class: Restriction
  on property: relatesTo
  some values from: Stress
definition: kleinste Spannung während des plastischen Fließens, wobei Einschwingerscheinungen nicht berücksichtigt werden @de
definition: Symbol: R_eL
definition: lowest value of stress during plastic yielding, ignoring any initial transient effects
definition source: DIN EN ISO 6892-1:2019

Parallel Length
type: Class
label: Parallele Länge @de
subclass of: Length
definition: Länge des parallelen reduzierten Querschnitts der Probe Anmerkung: Bei unbearbeiteten Proben tritt an die Stelle der parallelen Länge der Abstand zwischen den Einspannungen. @de
definition: Symbol: L_c
definition: length of the parallel reduced section of the test piece Note: The concept of parallel length is replaced by the concept of distance between grips for unmachined test pieces.
definition source: DIN EN ISO 6892-1:2019

Percentage Elongation After Fracture
type: Class
label: Bruchdehnung @de
subclass of: Elongation
equivalent class: Restriction
  on property: relatesTo
  some values from: Original Gauge Length
definition: bleibende Verlängerung der Messlänge nach dem Bruch (L_u − L_o), angegeben in Prozent, bezogen auf die Anfangsmesslänge @de
definition: Symbol: A
definition: permanent elongation of the gauge length after fracture (L_u − L_o), expressed as a percentage of the original gauge length
definition source: DIN EN ISO 6892-1:2019

Proof Strength Plastic Extension
type: Class
label: Dehngrenze bei plastischer Extensometer-Dehnung @de
subclass of: Proof Strength
equivalent class: Restriction
  on property: relates to extension
  some values from: Restriction
    on property: value
    some values from: float
definition: Spannung, bei der die plastische Extensometer-Dehnung einem vorgegebenen Prozentanteil der Extensometer-Messlänge entspricht Anmerkung: Der Index wird durch den Zahlenwert ergänzt, der den vorgegebenen Zahlenwert der plastischen Extensometer-Dehnung in Prozent angibt, z. B. R_p_0,2. @de
definition: Symbol: R_p
definition: stress at which the plastic extension is equal to a specified percentage of the extensometer gauge length Note: A suffix is added to the subscript to indicate the prescribed percentage, e.g. R_p_0.2. Source: ISO 6892-1:2019
definition source: DIN EN ISO 6892-1:2019

Slope Of The Elastic Part
type: Class
label: Steigung des elastischen Bereichs @de
subclass of: ValueObject
definition: Diese Eigenschaft beschreibt den Wert der Steigung des ersten linear ansteigenden Teils ("elastischer Teil") in der bei einem Zugversuch erhaltenen Spannungs-Dehnungs-Kurve. Im elastischen Teil der Spannungs-Dehnungs-Kurve muss der Wert der Steigung nicht unbedingt dem Elastizitätsmodul entsprechen. Dieser Wert kann mit dem Wert des Elastizitätsmoduls (nur) sehr gut übereinstimmen, wenn optimale Bedingungen herrschten. @de
definition: This property describes the value of the slope of the first linear increasing part (‘elastic part’) in the stress-percentage extension curve obtained during a tensile test. In the elastic part of the stress‐percentage extension curve, the value of the slope may not necessarily represent the modulus of elasticity. This value may closely agree with the value of the modulus of elasticity if optimal conditions were used.
definition source: DIN EN ISO 6892-1:2019

Strain Rate
type: Class
label: Dehngeschwindigkeit @de
subclass of: TestingRate
definition: Zunahme der mit einem Extensometer in der Extensometer-Messlänge gemessenen Dehnung je Zeiteinheit @de
definition: Symbol: e^._L_e
definition: increase of strain, measured with an extensometer, in extensometer gauge length, per time
definition source: DIN EN ISO 6892-1:2019

Tensile Strength
type: Class
label: Zugfestigkeit @de
subclass of: ValueObject
equivalent class: Class
  intersection of: Restriction
    on property: relatesTo
    some values from: Stress
  intersection of: Restriction
    on property: relatesTo
    some values from: Maximum Force
definition: Spannung, die der Höchstkraft entspricht @de
definition: Symbol: R_m
definition: stress corresponding to the maximum force
definition source: DIN EN ISO 6892-1:2019

Tensile Test
type: Class
label: Zugversuch @de
subclass of: MechanicalTestingProcess
equivalent class: Restriction
  on class: TestPiece
  on property: participant
  qualified cardinality: 1
equivalent class: Restriction
  on class: Tensile Testing Machine
  on property: participant
  qualified cardinality: 1
definition: Zugversuche (Zugprüfungen) an Werkstoffen geben Auskunft über deren Festigkeit, Duktilität sowie weitere Kennwerte unter einachsiger Zugbeanspruchung. Beim Zugversuch wird ein Prüfkörper durch Zugkraft belastet, im Allgemeinen bis zum Bruch, um eine oder mehrere mechanische Eigenschaften zu bestimmen, die durch die semantisch verknüpften und definierten Begriffe festgelegt sind. @de
definition: Tensile tests (tension tests) on materials provide information on their strength, ductility as well as other characteristic values under uniaxial tensile stress. The tensile test involves straining a test piece by tensile force, generally to fracture, for the determination of one or more mechanical properties specified by the semantically related and defined terms.
definition source: DIN EN ISO 6892-1:2019

Tensile Testing Machine
type: Class
label: Zugprüfmaschine @de
subclass of: TestingMachine
definition: Maschine zur Durchführung eines Zugversuches; die Regelung und Überwachung des Versuches, die Messungen und die Datenverarbeitung werden üblicherweise mithilfe eines Computers durchgeführt. @de
definition: machine to conduct a tensile test; the control and monitoring of the test, the measurements, and the data processing are usually undertaken by computer
definition source: DIN EN ISO 6892-1:2019

Upper Yield Strength
type: Class
label: Obere Streckgrenze @de
subclass of: Yield Strength
equivalent class: Restriction
  on property: relatesTo
  some values from: Stress
definition: höchste Spannung, bevor der erste Kraftabfall auftritt @de
definition: Symbol: R_eH
definition: maximum value of stress prior to the first decrease in force
definition source: DIN EN ISO 6892-1:2019

relates to extension
type: ObjectProperty
domain: Proof Strength Plastic Extension
range: PercentageExtension
sub property of: relatesTo

Identifier
type: Class
label: Identifikator @de
subclass of: ValueObject
definition: A named value intended to distinguish between entities.

Original Thickness
type: Class
label: Anfangs-Dicke @de
subclass of: Thickness
definition: Diese Entität beschreibt die gemessene Dimension in einer Richtung eines Prüfstücks, wie sie vor der Prüfung gemessen wurde. @de
definition: This entity describes the measured dimension in one direction of a test piece, as measured before the test.

Original Width
type: Class
label: Anfangs-Breite @de
subclass of: Width
definition: Diese Entität beschreibt eine horizontale Messung eines Objekts (Prüfkörpers) im rechten Winkel zur Länge des Objekts (Prüfkörpers), wie sie vor einer Prüfung gemessen wird. @de
definition: This entity describes a horizontal measurement of an object (test piece) taken at right angles to the length of the object (test piece), as measured before a test.

Debug
type: NamedIndividual
type: Location
type: Tensile Testing Machine
characteristic: Debug manufacturer
characteristic: Debug model
characteristic: Debug serial number
characteristic: Debug standards
value: Debug

Extensometer Gauge Length
type: Class
label: Extensometer-Messlänge @de
subclass of: Gauge Length
definition: Anfangsmesslänge des Dehnungsaufnehmers (Extensometer), die zum Messen der Verlängerung benutzt wird Anmerkung: Für die Bestimmung mehrerer Eigenschaften, die (teilweise oder vollständig) von der Verlängerung abhängig sind, z. B. R_p, A_e oder A_g, ist die Verwendung eines Extensometers zwingend erforderlich. @de
definition: Symbol: L_e
definition: initial gauge length of the extensometer used for measurement of extension Note: For the determination of several properties which are based (partly or complete) on extension, e. g. R_p, A_e or A_g, the use of an extensometer is mandatory.
definition source: DIN EN ISO 6892-1:2019

Maximum Force
type: Class
label: Höchstkraft @de
subclass of: Force
definition: Bei Werkstoffen, die kein diskontinuierliches Fließen zeigen: größte Kraft, der die Probe während des Versuchs standhält Bei Werkstoffen, die ein diskontinuierliches Fließen zeigen: größte Kraft, der die Probe während des Versuchs nach dem Beginn der Verfestigung standhält Anmerkung: Für Werkstoffe, die ein diskontinuierliches Fließen zeigen, aber keine Verfestigung erzielt werden kann, ist die Höchstkraft nicht definiert . @de
definition: For materials displaying no discontinuous yielding: highest force that the test piece withstands during the test For materials displaying discontinuous yielding: highest force that the test piece withstands during the test after the beginning of work-hardening Note: For materials which display discontinuous yielding, but where no work-hardening can be established, the maximum force is not defined.
definition source: DIN EN ISO 6892-1:2019

Original Gauge Length
type: Class
label: Anfangsmesslänge @de
subclass of: Gauge Length
definition: Länge zwischen den Marken zur Kennzeichnung der Messlänge auf der Probe, die vor dem Versuch bei Raumtemperatur gemessen wird @de
definition: Symbol: L_o
definition: length between gauge length marks on the test piece measured at room temperature before the test
definition source: DIN EN ISO 6892-1:2019

Primary Data
type: Class
label: Primärdaten @de
subclass of: Data Scope
definition: Die Datenkategorie Primärdaten umfasst Daten, die vor / nach einem Prozess erfasst werden, entweder bezogen auf die Geometrie des Objekts (z.B. ao, bo, do, au, bu, du, Lu) oder als Register des gesamten Aufbaus (z.B. Skizzen, Fotos oder Videos) @de
definition: This data scope expresses that a ValueObject refers to data that is directly acquired during a process by sensors (time, force, length, temperature)

Secondary Data
type: Class
label: Sekundärdaten @de
subclass of: Data Scope
definition: Der Datenkategorie Sekundärdaten umfasst Werte (z. B. Testergebnisse), die durch Gleichungen oder Algorithmen unter Verwendung von Primärdaten und Metadaten ermittelt werden. @de
definition: This data scope expresses that a ValueObject refers to characteristic values (e.g. test results) determined by equations or algorithms using primary data and/or metadata.

Measurement
type: Class
label: Messwert @de
subclass of: Value Scope
definition: Die Wertekategorie Messung ermöglicht die Kategorisierung von ValueObjects als gemessen. Messung ist die Quantifizierung von Eigenschaften eines Objekts oder Ereignisses, die zum Vergleich mit anderen Objekten oder Ereignissen verwendet werden können. @de
definition: The ValueScope category Measurement enables the categorization of ValueObjects as measured. Measurement is the quantification of attributes of an object or event, which can be used to compare with other objects or events.

Metadata
type: Class
label: Metadaten @de
subclass of: Data Scope
subclass of: ValueObject
definition: Die DataScope Metadaten umfassen Attribute und zusätzliche Daten (Provenienz), die z.B. die Fabrik, das Labor, das Prozesssystem und die Objekte betreffen und die eine Bewertung der Qualität / Zuverlässigkeit der Messungen und eine systematische Suche in einer Datenbank ermöglichen. @de
definition: This data scope expresses that a :ValueObject refers to attributes and additional data (provenance) on production, laboratory, process system and objects that enable an evaluation of the quality/reliability of the measurements and a systematic search task in a database.